BDBM50492035 CHEMBL2391054
SMILES Cc1c(cc(-c2ccc(cc2)S(C)(=O)=O)n1-c1cccc(F)c1)C#N
InChI Key InChIKey=IGZRBPKGKADYLT-UHFFFAOYSA-N
Data  4 IC50
  Tab Delimited (TSV)   2D SDfile   Computed 3D by Vconf -m prep SDfile
Find this compound or compounds like it in BindingDB:
Activity Spreadsheet -- Enzyme Inhibition Constant Data from BindingDB
Found 4 hits for monomerid = 50492035
TargetProstaglandin G/H synthase 1(Homo sapiens (Human))
Universit£
Curated by ChEMBL
LigandPNGBDBM50492035(CHEMBL2391054)
Affinity DataIC50:  5.05E+4nM. Assay description: Inhibition of platelet COX1 in human whole blood assessed as inhibition of serum TXB2 production after 1 hr by radioimmunoassay
Ligand InfoPC cidPC sid
In DepthDetails ArticlePubMed
TargetProstaglandin G/H synthase 1(Mus musculus)
Universit£
Curated by ChEMBL
LigandPNGBDBM50492035(CHEMBL2391054)
Affinity DataIC50: >1.00E+4nM. Assay description: Inhibition of COX1 in mouse J774 cells using arachidonic acid as substrate assessed as inhibition of PGE2 production incubated for 15 mins prior to s...
Ligand InfoPC cidPC sid
In DepthDetails ArticlePubMed
TargetProstaglandin G/H synthase 2(Mus musculus (Mouse))
Universit£
Curated by ChEMBL
LigandPNGBDBM50492035(CHEMBL2391054)
Affinity DataIC50:  13nM. Assay description: Inhibition of COX2 in mouse J774 cells assessed as inhibition of LPS-induced PGE2 production by radioimmunoassay
Ligand InfoPC cidPC sid
In DepthDetails ArticlePubMed
TargetProstaglandin G/H synthase 2(Homo sapiens (Human))
Universit£
Curated by ChEMBL
LigandPNGBDBM50492035(CHEMBL2391054)
Affinity DataIC50:  1.30E+3nM. Assay description: Inhibition of monocyte COX2 in human whole blood assessed as inhibition of LPS-induced plasma PGE2 production after 24 hrs by radioimmunoassay
Ligand InfoPC cidPC sid
In DepthDetails ArticlePubMed