BDBM50493721 CHEMBL2436045
SMILES Oc1cccc(c1)C(N1C2CCC3C1CCC2N3CC=C)c1ccc(cc1)C(=O)N1CCCCC1
InChI Key InChIKey=BXZXTSAWQCBSOL-UHFFFAOYSA-N
Data  2 KI
  Tab Delimited (TSV)   2D SDfile   Computed 3D by Vconf -m prep SDfile
Find this compound or compounds like it in BindingDB:
Activity Spreadsheet -- Enzyme Inhibition Constant Data from BindingDB
Found 2 hits for monomerid = 50493721
TargetDelta-type opioid receptor(MOUSE)
C.N.R. Istituto Di Farmacologia Traslazionale
Curated by ChEMBL
LigandPNGBDBM50493721(CHEMBL2436045)
Affinity DataKi:  2.5nM. Assay description: Displacement of [3H]DPDPE from mouse brain delta opioid receptor by scintillation counting analysis
Ligand InfoPC cidPC sid
In DepthDetails ArticlePubMed
TargetMu-type opioid receptor(MOUSE)
C.N.R. Istituto Di Farmacologia Traslazionale
Curated by ChEMBL
LigandPNGBDBM50493721(CHEMBL2436045)
Affinity DataKi:  170nM. Assay description: Displacement of [3H]DAMGO from mouse brain mu opioid receptor by scintillation counting analysis
Ligand InfoPC cidPC sid
In DepthDetails ArticlePubMed