BDBM50493946 CHEMBL2442472
SMILES CC(C)(C)CNC(=O)Cc1ccc(Nc2nc(ncc2C(N)=O)-c2ccccc2)cc1
InChI Key InChIKey=FTPBVAQEKZTHST-UHFFFAOYSA-N
Data  1 IC50
PDB links: 1 PDB ID matches this monomer.
  Tab Delimited (TSV)   2D SDfile   Computed 3D by Vconf -m prep SDfile
Find this compound or compounds like it in BindingDB:
Activity Spreadsheet -- Enzyme Inhibition Constant Data from BindingDB
Found 1 hit for monomerid = 50493946
TargetcAMP-specific 3',5'-cyclic phosphodiesterase 4B(Homo sapiens (Human))
Kyushu University
Curated by ChEMBL
LigandPNGBDBM50493946(CHEMBL2442472)
Affinity DataIC50:  8.30nM. Assay description: Inhibition of recombinant human PDE4B using cAMP as substrate after 30 mins
Ligand InfoPC cidPC sidPDB