BDBM50494147 CHEMBL3085793
SMILES Cc1ncc(n1CCOS(N)(=O)=O)[N+]([O-])=O
InChI Key InChIKey=PBAHHCUVLKOILA-UHFFFAOYSA-N
Data  4 KI
PDB links: 1 PDB ID matches this monomer.
  Tab Delimited (TSV)   2D SDfile   Computed 3D by Vconf -m prep SDfile
Find this compound or compounds like it in BindingDB:
Activity Spreadsheet -- Enzyme Inhibition Constant Data from BindingDB
Found 4 hits for monomerid = 50494147
TargetCarbonic anhydrase 9(Homo sapiens (Human))
Ecole Nationale Sup£Rieure De Chimie De Montpellier
Curated by ChEMBL
LigandPNGBDBM50494147(CHEMBL3085793)
Affinity DataKi:  8.30nM. Assay description: Inhibition of recombinant human catalytic domain of carbonic anhydrase-9 preincubated for 15 mins by stopped-flow CO2 hydration assay
Ligand InfoPC cidPC sidPDB
In DepthDetails ArticlePubMed
TargetCarbonic anhydrase 12(Homo sapiens (Human))
Ecole Nationale Sup£Rieure De Chimie De Montpellier
Curated by ChEMBL
LigandPNGBDBM50494147(CHEMBL3085793)
Affinity DataKi:  8.90nM. Assay description: Inhibition of recombinant human catalytic domain of carbonic anhydrase-12 preincubated for 15 mins by stopped-flow CO2 hydration assay
Ligand InfoPC cidPC sidPDB
In DepthDetails ArticlePubMed
TargetCarbonic anhydrase 2(Homo sapiens (Human))
Ecole Nationale Sup£Rieure De Chimie De Montpellier
Curated by ChEMBL
LigandPNGBDBM50494147(CHEMBL3085793)
Affinity DataKi:  34nM. Assay description: Inhibition of full length human cytosolic carbonic anhydrase-2 preincubated for 15 mins by stopped-flow CO2 hydration assay
Ligand InfoPC cidPC sidPDB
TargetCarbonic anhydrase 1(Homo sapiens (Human))
Ecole Nationale Sup£Rieure De Chimie De Montpellier
Curated by ChEMBL
LigandPNGBDBM50494147(CHEMBL3085793)
Affinity DataKi:  4.44E+3nM. Assay description: Inhibition of full length human cytosolic carbonic anhydrase-1 preincubated for 15 mins by stopped-flow CO2 hydration assay
Ligand InfoPC cidPC sidPDB
In DepthDetails ArticlePubMed