BDBM50498531 CHEMBL3605642
SMILES [H][C@@]12OC[C@H](OC(=O)N[C@@H](Cc3ccccc3)[C@H](O)CN(CC(C)C)S(=O)(=O)c3ccc(OC)cc3)[C@]1([H])[C@H](CO2)N(C)C(=O)OC(C)(C)C
InChI Key InChIKey=OEJFCUWTVNZGJI-RWIUVVJRSA-N
Data  1 KI
  Tab Delimited (TSV)   2D SDfile   Computed 3D by Vconf -m prep SDfile
Find this compound or compounds like it in BindingDB:
Activity Spreadsheet -- Enzyme Inhibition Constant Data from BindingDB
Found 1 hit for monomerid = 50498531
TargetProtease(Human immunodeficiency virus 1 (HIV-1))
Purdue University
Curated by ChEMBL
LigandPNGBDBM50498531(CHEMBL3605642)
Affinity DataKi:  0.0120nM. Assay description: Inhibition of HIV1 protease
Ligand InfoPC cidPC sid
In DepthDetails ArticlePubMed