BDBM50500353 CHEMBL3746395::US11066363, Compound 10
SMILES CCc1cc2C(=O)c3c([nH]c4cc(ccc34)C#N)C(C)(C)c2cc1-c1cnoc1
InChI Key InChIKey=BMWIOANJDKPITJ-UHFFFAOYSA-N
Data  3 IC50
  Tab Delimited (TSV)   2D SDfile   Computed 3D by Vconf -m prep SDfile
Find this compound or compounds like it in BindingDB:
Activity Spreadsheet -- Enzyme Inhibition Constant Data from BindingDB
Found 3 hits for monomerid = 50500353
TargetALK tyrosine kinase receptor/Echinoderm microtubule-associated protein-like 4(Homo sapiens (Human))
Dana-Farber Cancer Institute
Curated by ChEMBL
LigandPNGBDBM50500353(CHEMBL3746395 | US11066363, Compound 10)
Affinity DataIC50:  59nM. Assay description: Inhibition of wild type EML4-ALK (unknown origin) expressed in mouse Ba/F3 cells assessed as cell viability after 72 hrs by MTS assay
Ligand InfoPC cidPC sid
In DepthDetails ArticlePubMed
TargetSRSF protein kinase 2(Homo sapiens (Human))
Dana-Farber Cancer Institute
US Patent
LigandPNGBDBM50500353(CHEMBL3746395 | US11066363, Compound 10)
Affinity DataIC50:  14.5nM. Assay description: SRPK1 Inhibitory Activities of the Compounds.
Ligand InfoPC cidPC sid
In DepthDetails US Patent
TargetSRSF protein kinase 1(Homo sapiens (Human))
Dana-Farber Cancer Institute
US Patent
LigandPNGBDBM50500353(CHEMBL3746395 | US11066363, Compound 10)
Affinity DataIC50:  5.09nM. Assay description: SRPK1 Inhibitory Activities of the Compounds.
Ligand InfoPC cidPC sid
In DepthDetails US Patent