BDBM50506049 CHEMBL4466072
SMILES Cc1c(nc(-c2ccc(Cl)o2)n1-c1c(Cl)ccc(NCC(C)(C)C(O)=O)c1Cl)C1(CC1)C(F)(F)F
InChI Key InChIKey=GMUBBGHCRSLTDM-UHFFFAOYSA-N
Data  4 IC50
  Tab Delimited (TSV)   2D SDfile   Computed 3D by Vconf -m prep SDfile
Find this compound or compounds like it in BindingDB:
Activity Spreadsheet -- Enzyme Inhibition Constant Data from BindingDB
Found 4 hits for monomerid = 50506049
TargetNuclear receptor ROR-gamma(Homo sapiens (Human))
Global Discovery Chemistry
Curated by ChEMBL
LigandPNGBDBM50506049(CHEMBL4466072)
Affinity DataIC50:  331nM. Assay description: Inverse agonist activity at RORgammat in human whole blood assessed as reduction in Con A/IL-23-stimulated IL-17 secretion after 72 hrs by ELISA
Ligand InfoPC cidPC sid
In DepthDetails ArticlePubMed
TargetNuclear receptor ROR-gamma(Homo sapiens (Human))
Global Discovery Chemistry
Curated by ChEMBL
LigandPNGBDBM50506049(CHEMBL4466072)
Affinity DataIC50:  5nM. Assay description: Displacement of RIP140 cofactor peptide from human His6-tagged RORgammat LBD (264 to 518 residues) by TR-FRET assay
Ligand InfoPC cidPC sid
In DepthDetails ArticlePubMed
TargetNuclear receptor ROR-gamma(Homo sapiens (Human))
Global Discovery Chemistry
Curated by ChEMBL
LigandPNGBDBM50506049(CHEMBL4466072)
Affinity DataIC50:  21nM. Assay description: Inhibition of human full-length eGFP-tagged RORgammat expressed in human HUT78 T-cells assessed as inhibition of PMA/CD3 monoclonal antibody stimulat...
Ligand InfoPC cidPC sid
In DepthDetails ArticlePubMed
TargetNuclear receptor ROR-gamma(Homo sapiens (Human))
Global Discovery Chemistry
Curated by ChEMBL
LigandPNGBDBM50506049(CHEMBL4466072)
Affinity DataIC50:  120nM. Assay description: Inhibition of human GAL4-DBD fused RORgammat LBD expressed in human Jurkat cells assessed as inhibition of receptor transactivation after 24 hrs by l...
Ligand InfoPC cidPC sid
In DepthDetails ArticlePubMed