BDBM50509487 CHEMBL4471162
SMILES CC[C@H](C)C[C@H](C)C[C@H](CO)C[C@@H](C)\C=C(/C)\C=C(/C)\C=C\C=C\C(=O)N1CCCC(O)C1=O
InChI Key InChIKey=ILIRNOFAKGDUJL-DINPGYPASA-N
Data  1 KI  1 IC50
  Tab Delimited (TSV)   2D SDfile   Computed 3D by Vconf -m prep SDfile
Find this compound or compounds like it in BindingDB:
Activity Spreadsheet -- Enzyme Inhibition Constant Data from BindingDB
Found 2 hits for monomerid = 50509487
TargetTYR_PHOSPHATASE_2 domain-containing protein(Mycobacterium tuberculosis)
Guangdong Institute Of Microbiology
Curated by ChEMBL
LigandPNGBDBM50509487(CHEMBL4471162)
Affinity DataKi:  1.60E+4nM. Assay description: Non-competitive inhibition of Mycobacterium tuberculosis H37Rv ptpB expressed in Escherichia coli BL21 (DH3) cells using p-nitrophenyl phosphate as s...
Ligand InfoPC cidPC sid
In DepthDetails ArticlePubMed
TargetTYR_PHOSPHATASE_2 domain-containing protein(Mycobacterium tuberculosis)
Guangdong Institute Of Microbiology
Curated by ChEMBL
LigandPNGBDBM50509487(CHEMBL4471162)
Affinity DataIC50:  1.10E+4nM. Assay description: Inhibition of Mycobacterium tuberculosis H37Rv ptpB expressed in Escherichia coli BL21 (DH3) cells using 6,8-difluoromethylumbelliferyl phosphate as ...
Ligand InfoPC cidPC sid
In DepthDetails ArticlePubMed