BDBM50518726 CHEMBL4474325
SMILES COc1ccc(CNc2nn(C)c3c2sc2nnc(C)c(C)c32)cc1
InChI Key InChIKey=RWAYGWYLIWQWLU-UHFFFAOYSA-N
Data  1 EC50
  Tab Delimited (TSV)   2D SDfile   Computed 3D by Vconf -m prep SDfile
Find this compound or compounds like it in BindingDB:
Activity Spreadsheet -- Enzyme Inhibition Constant Data from BindingDB
Found 1 hit for monomerid = 50518726
TargetMuscarinic acetylcholine receptor M4(Homo sapiens (Human))
Vanderbilt University
Curated by ChEMBL
LigandPNGBDBM50518726(CHEMBL4474325)
Affinity DataEC50:  40nM. Assay description: Positive allosteric modulation of Gqi5-fused human M4 AChR assessed as increase in acetylcholine-induced calcium mobilization
Ligand InfoPC cidPC sid
In DepthDetails ArticlePubMed