BDBM50521427 CHEMBL4533205
SMILES Oc1c(OCC(F)(F)F)cc(cc1OCC(F)(F)F)-c1nc(c([nH]1)-c1cccs1)-c1ccccc1
InChI Key InChIKey=IQDQJTILAMMREJ-UHFFFAOYSA-N
Data  1 IC50
  Tab Delimited (TSV)   2D SDfile   Computed 3D by Vconf -m prep SDfile
Find this compound or compounds like it in BindingDB:
Activity Spreadsheet -- Enzyme Inhibition Constant Data from BindingDB
Found 1 hit for monomerid = 50521427
TargetSphingomyelin phosphodiesterase 3(Homo sapiens)
Johns Hopkins University
Curated by ChEMBL
LigandPNGBDBM50521427(CHEMBL4533205)
Affinity DataIC50:  70nM. Assay description: Inhibition of human recombinant nSMase expressed in HEK293 cells using sphingomyelin as substrate by alkaline phosphatase, choline oxidase and horser...
Ligand InfoPC cidPC sid
In DepthDetails ArticlePubMed