BDBM50524382 CHEMBL4559996
SMILES OC[C@H]1O[C@H]([C@H](O)[C@@H]1O)n1cnc2c(ncnc12)-c1ccsc1
InChI Key InChIKey=UXKNTUXJYSDVTH-LHNIVKCTSA-N
Data  1 IC50
PDB links: 1 PDB ID matches this monomer.
  Tab Delimited (TSV)   2D SDfile   Computed 3D by Vconf -m prep SDfile
Find this compound or compounds like it in BindingDB:
Activity Spreadsheet -- Enzyme Inhibition Constant Data from BindingDB
Found 1 hit for monomerid = 50524382
TargetAdenosine kinase(Mycobacterium tuberculosis (strain ATCC 25618 / H3...)
Texas A&M University
Curated by ChEMBL
LigandPNGBDBM50524382(CHEMBL4559996)
Affinity DataIC50:  197nM. Assay description: Inhibition of wild-type N-terminal TEV cleavage site-fused/His-tagged Mycobacterium tuberculosis H37Rv adenosine kinase expressed in Escherichia coli...
Ligand InfoPC cidPC sidPDB