BDBM50529606 Beta-Eudesmol::CHEBI:10417
SMILES [H][C@@]12C[C@@H](CC[C@@]1(C)CCCC2=C)C(C)(C)O
InChI Key InChIKey=BOPIMTNSYWYZOC-VNHYZAJKSA-N
Data  2 EC50
  Tab Delimited (TSV)   2D SDfile   Computed 3D by Vconf -m prep SDfile
Find this compound or compounds like it in BindingDB:
Activity Spreadsheet -- Enzyme Inhibition Constant Data from BindingDB
Found 2 hits for monomerid = 50529606
TargetTransient receptor potential cation channel subfamily A member 1(Homo sapiens (Human))
Univerisity Of Eastern Finland (Uef)
Curated by ChEMBL
LigandPNGBDBM50529606(Beta-Eudesmol | CHEBI:10417)
Affinity DataEC50:  3.30E+4nM. Assay description: Agonist activity at human TRPA1
In DepthDetails ArticlePubMed
TargetTransient receptor potential cation channel subfamily A member 1(Homo sapiens (Human))
Univerisity Of Eastern Finland (Uef)
Curated by ChEMBL
LigandPNGBDBM50529606(Beta-Eudesmol | CHEBI:10417)
Affinity DataEC50:  3.30E+4nM. Assay description: Agonist activity at human TRPA1
In DepthDetails ArticlePubMed