BDBM50532828 CHEMBL4460600
SMILES C(c1ccccc1)c1cc2CCNCCc2nn1
InChI Key InChIKey=BOXZVOHYJCFWPI-UHFFFAOYSA-N
Data  2 KI  2 EC50
  Tab Delimited (TSV)   2D SDfile   Computed 3D by Vconf -m prep SDfile
Find this compound or compounds like it in BindingDB:
Activity Spreadsheet -- Enzyme Inhibition Constant Data from BindingDB
Found 4 hits for monomerid = 50532828
Target5-hydroxytryptamine receptor 2C(Homo sapiens (Human))
Pfizer
Curated by ChEMBL
LigandPNGBDBM50532828(CHEMBL4460600)
Affinity DataKi:  80nM. Assay description: Displacement of [3H]-mesulergine from recombinant human 5-HT2C receptor transfected in Swiss mouse 3T3 cells after 150 mins by scintillation proximit...
Ligand InfoPC cidPC sid
In DepthDetails ArticlePubMed
Target5-hydroxytryptamine receptor 2C(Homo sapiens (Human))
Pfizer
Curated by ChEMBL
LigandPNGBDBM50532828(CHEMBL4460600)
Affinity DataKi:  80nM. Assay description: Displacement of [3H]-mesulergine from recombinant human 5-HT2C receptor transfected in Swiss mouse 3T3 cells after 150 mins by scintillation proximit...
Ligand InfoPC cidPC sid
In DepthDetails ArticlePubMed
Target5-hydroxytryptamine receptor 2C(Homo sapiens (Human))
Pfizer
Curated by ChEMBL
LigandPNGBDBM50532828(CHEMBL4460600)
Affinity DataEC50:  130nM. Assay description: Agonist activity at recombinant human 5-HT2C receptor transfected in CHOK1 cells assessed as calcium mobilization by FLIPR assay
Ligand InfoPC cidPC sid
In DepthDetails ArticlePubMed
Target5-hydroxytryptamine receptor 2C(Homo sapiens (Human))
Pfizer
Curated by ChEMBL
LigandPNGBDBM50532828(CHEMBL4460600)
Affinity DataEC50:  130nM. Assay description: Agonist activity at recombinant human 5-HT2C receptor transfected in CHOK1 cells assessed as calcium mobilization by FLIPR assay
Ligand InfoPC cidPC sid
In DepthDetails ArticlePubMed