BDBM50535485 CHEMBL4594145
SMILES CC1(O)CC(c2c(O1)c1ccccc1oc2=O)/C1=C/C=C\C=C/C=C\1
InChI Key InChIKey=LMJHSJCEICXGOL-UZDYRDJKSA-N
Data  1 IC50
  Tab Delimited (TSV)   2D SDfile   Computed 3D by Vconf -m prep SDfile
Find this compound or compounds like it in BindingDB:
Activity Spreadsheet -- Enzyme Inhibition Constant Data from BindingDB
Found 1 hit for monomerid = 50535485
TargetVitamin K epoxide reductase complex subunit 1(Homo sapiens (Human))
University Of Queensland
Curated by ChEMBL
LigandPNGBDBM50535485(CHEMBL4594145)
Affinity DataIC50:  4.5nM. Assay description: Inhibition of VKOR (unknown origin) in HEK293 expressing FIXgla-PC incubated for 48 hrs by ELISA
Ligand InfoPC cidPC sid
In DepthDetails ArticlePubMed