BDBM50538205 CHEMBL4636528
SMILES Fc1ccc(NC(=O)OCC2CCNCC2)c(c1)-c1ccc(F)c(Cl)c1
InChI Key InChIKey=GUWDPEQJYFKDCE-UHFFFAOYSA-N
Data  6 KI  3 EC50
  Tab Delimited (TSV)   2D SDfile   Computed 3D by Vconf -m prep SDfile
Find this compound or compounds like it in BindingDB:
Activity Spreadsheet -- Enzyme Inhibition Constant Data from BindingDB
Found 9 hits for monomerid = 50538205
TargetMuscarinic acetylcholine receptor M3(Homo sapiens (Human))TBA
LigandPNGBDBM50538205(CHEMBL4636528)
Affinity DataKi:  0.0640nM. Assay description: Displacement of [3H]N-methylscopolamine from human muscarinic M3 receptor expressed in human HEK293T cell membranes by radioligand competition bindin...
Ligand InfoPC cidPC sid
In DepthDetails PubMed
TargetMuscarinic acetylcholine receptor M3(Homo sapiens (Human))TBA
LigandPNGBDBM50538205(CHEMBL4636528)
Affinity DataKi:  0.0690nM. Assay description: Displacement of [3H]N-methylscopolamine from human muscarinic M3 receptor transiently expressed in HEK293T cell membranes incubated for 1 hr by scint...
Ligand InfoPC cidPC sid
In DepthDetails ArticlePubMed
TargetMuscarinic acetylcholine receptor M1(Homo sapiens (Human))TBA
LigandPNGBDBM50538205(CHEMBL4636528)
Affinity DataKi:  0.230nM. Assay description: Displacement of [3H]N-methylscopolamine from human muscarinic M1 receptor expressed in human HEK293T cell membranes by radioligand competition bindin...
Ligand InfoPC cidPC sid
In DepthDetails PubMed
TargetMuscarinic acetylcholine receptor M1(Homo sapiens (Human))TBA
LigandPNGBDBM50538205(CHEMBL4636528)
Affinity DataKi:  0.270nM. Assay description: Displacement of [3H]N-methylscopolamine from human muscarinic M1 receptor transiently expressed in HEK293T cell membranes incubated for 1 hr by scint...
Ligand InfoPC cidPC sid
In DepthDetails ArticlePubMed
TargetMuscarinic acetylcholine receptor M2(Homo sapiens (Human))TBA
LigandPNGBDBM50538205(CHEMBL4636528)
Affinity DataKi:  3.40nM. Assay description: Displacement of [3H]N-methylscopolamine from human muscarinic M2 receptor expressed in human HEK293T cell membranes by radioligand competition bindin...
Ligand InfoPC cidPC sid
In DepthDetails PubMed
TargetMuscarinic acetylcholine receptor M2(Homo sapiens (Human))TBA
LigandPNGBDBM50538205(CHEMBL4636528)
Affinity DataKi:  3.40nM. Assay description: Displacement of [3H]N-methylscopolamine from human muscarinic M2 receptor transiently expressed in HEK293T cell membranes incubated for 1 hr by scint...
Ligand InfoPC cidPC sid
In DepthDetails ArticlePubMed
TargetMuscarinic acetylcholine receptor M3(Homo sapiens (Human))TBA
LigandPNGBDBM50538205(CHEMBL4636528)
Affinity DataEC50:  4.10nM. Assay description: Antagonist activity at muscarinic M3 receptor (unknown origin) expressed in HEK293 cells coexpressing EA tagged beta-arrestin2 assessed as inhibition...
Ligand InfoPC cidPC sid
In DepthDetails ArticlePubMed
TargetMuscarinic acetylcholine receptor M3(Homo sapiens (Human))TBA
LigandPNGBDBM50538205(CHEMBL4636528)
Affinity DataEC50:  4.10nM. Assay description: Agonist activity at human muscarinic M3 receptor expressed in HEK293 cells assessed as increase in IP1 accumulation incubated for 90 min by TR-HTRF a...
Ligand InfoPC cidPC sid
In DepthDetails ArticlePubMed
TargetMuscarinic acetylcholine receptor M3(Homo sapiens (Human))TBA
LigandPNGBDBM50538205(CHEMBL4636528)
Affinity DataEC50:  9.30nM. Assay description: Antagonist activity at human muscarinic M3 receptor expressed in HEK293 assessed as inhibition of carbachol-induced IP1 accumulation preincubated for...
Ligand InfoPC cidPC sid
In DepthDetails ArticlePubMed