BDBM50541810 CHEMBL4645744
SMILES C[C@@H]1CN([C@@H](C)CN1C(c1ccc(F)cc1)c1ccc(F)cc1)c1cc(=O)n(C)c2ccc(nc12)C#N
InChI Key InChIKey=XKXKEJGUONTNBW-RBUKOAKNSA-N
Data  4 IC50
  Tab Delimited (TSV)   2D SDfile   Computed 3D by Vconf -m prep SDfile
Find this compound or compounds like it in BindingDB:
Activity Spreadsheet -- Enzyme Inhibition Constant Data from BindingDB
Found 4 hits for monomerid = 50541810
TargetDiacylglycerol kinase alpha(Homo sapiens)
Therachem Research Medilab
Curated by ChEMBL
LigandPNGBDBM50541810(CHEMBL4645744)
Affinity DataIC50:  190nM. Assay description: Inhibition of full-length C-terminal His6 tagged TVMV-pFBgate fused human DGKalpha expressed in baculovirus infected Sf9 insect cells using liposome ...
Ligand InfoPC cidPC sid
In DepthDetails ArticlePubMed
TargetDiacylglycerol kinase zeta(Homo sapiens)
Therachem Research Medilab
Curated by ChEMBL
LigandPNGBDBM50541810(CHEMBL4645744)
Affinity DataIC50:  460nM. Assay description: Inhibition of DGKalpha/zeta in human whole blood assessed as induction of T-cell activation by measuring IFNgamma level preincubated for 1 hr followe...
Ligand InfoPC cidPC sid
In DepthDetails ArticlePubMed
TargetDiacylglycerol kinase alpha/zeta(Homo sapiens)
Therachem Research Medilab
Curated by ChEMBL
LigandPNGBDBM50541810(CHEMBL4645744)
Affinity DataIC50:  43nM. Assay description: Inhibition of DGKA/DGKZ in human CD8 cells assessed as induction of CD8 activation by measuring IFNgamma level after 20 hrs by AlphaLISA assay
Ligand InfoPC cidPC sid
In DepthDetails ArticlePubMed
TargetDiacylglycerol kinase zeta(Homo sapiens)
Therachem Research Medilab
Curated by ChEMBL
LigandPNGBDBM50541810(CHEMBL4645744)
Affinity DataIC50:  400nM. Assay description: Inhibition of full length C-terminal His6tagged TVMV-His-pFBgate fused human DGK-zeta expressed in baculovirus infected Sf9 insect cells using liposo...
Ligand InfoPC cidPC sid
In DepthDetails ArticlePubMed