BDBM50568217 CHEMBL4866645
SMILES CNC(=O)[C@H]1Cc2c(CN1C(=O)[C@@H](Cc1ccccc1)NC(=O)c1c[nH]c(c1)C(N)=O)[nH]c1ccccc21
InChI Key InChIKey=BQMQLZXJTNCVAW-ISKFKSNPSA-N
Data  2 IC50
  Tab Delimited (TSV)   2D SDfile   Computed 3D by Vconf -m prep SDfile
Find this compound or compounds like it in BindingDB:
Activity Spreadsheet -- Enzyme Inhibition Constant Data from BindingDB
Found 2 hits for monomerid = 50568217
TargetTyrosine-protein kinase BTK(Homo sapiens (Human))
X-Chem
Curated by ChEMBL
LigandPNGBDBM50568217(CHEMBL4866645)
Affinity DataIC50:  56nM. Assay description: Inhibition of recombinant human N-terminal His-tagged BTK C481S mutant expressed in baculovirus infected in Sf9 cells incubated for 1 hr by TR-FRET a...
Ligand InfoPC cidPC sid
In DepthDetails ArticlePubMed
TargetTyrosine-protein kinase BTK(Homo sapiens (Human))
X-Chem
Curated by ChEMBL
LigandPNGBDBM50568217(CHEMBL4866645)
Affinity DataIC50:  23nM. Assay description: Inhibition of recombinant human N-terminal His-tagged BTK expressed in baculovirus infected in Sf9 cells incubated for 1 hr by TR-FRET assay
Ligand InfoPC cidPC sid
In DepthDetails ArticlePubMed