BDBM50572325 CHEMBL4860058
SMILES CC[C@H](C)[C@@H]1NC(=O)[C@H](CC(C)C)NC(=O)[C@H](Cc2c[nH]c3ccccc23)NC(=O)[C@H](Cc2ccc(O)cc2)NC(=O)[C@@H]2CCCN2C(=O)[C@H](C)NC(=O)[C@H](C)NC(=O)[C@H](Cc2ccc(O)cc2)NC(=O)CSC[C@H](NC(=O)[C@H](Cc2c[nH]c3ccccc23)NC(=O)[C@H](C)NC1=O)C(N)=O
InChI Key InChIKey=KMLIXEHILLUNKZ-WZAOXELRSA-N
Data  1 IC50
  Tab Delimited (TSV)   2D SDfile   Computed 3D by Vconf -m prep SDfile
Find this compound or compounds like it in BindingDB:
Activity Spreadsheet -- Enzyme Inhibition Constant Data from BindingDB
Found 1 hit for monomerid = 50572325
TargetCalcium and integrin-binding protein 1(Homo sapiens)
University Of North Carolina
Curated by ChEMBL
LigandPNGBDBM50572325(CHEMBL4860058)
Affinity DataIC50:  820nM. Assay description: Displacement of Alexa Fluor 647 labelled UNC10245092 peptide from CIB1 (unknown origin) preincubated for 20 mins followed by Alexa-CIB1 phage peptide...
Ligand InfoPC cidPC sid
In DepthDetails ArticlePubMed