BDBM50572335 CHEMBL4877672
SMILES CCCC[C@@H]1NC(=O)[C@H](Cc2ccc(O)cc2)N(C)C(=O)CSC[C@H](NC(=O)[C@H](Cc2c[nH]c3ccccc23)NC(=O)[C@@H](Cc2ccco2)NC(=O)[C@@H](NC(=O)[C@H](CC(C)C)NC(=O)[C@H](Cc2c[nH]c3ccccc23)NC(=O)[C@H](Cc2ccc(O)cc2)N(C)C(=O)[C@@H]2CCCN2C(=O)[C@H](CCC(N)=O)NC1=O)[C@@H](C)CC)C(N)=O
InChI Key InChIKey=AINWKBORTDYZBE-WLMMXGMGSA-N
Data  1 IC50
  Tab Delimited (TSV)   2D SDfile   Computed 3D by Vconf -m prep SDfile
Find this compound or compounds like it in BindingDB:
Activity Spreadsheet -- Enzyme Inhibition Constant Data from BindingDB
Found 1 hit for monomerid = 50572335
TargetCalcium and integrin-binding protein 1(Homo sapiens)
University Of North Carolina
Curated by ChEMBL
LigandPNGBDBM50572335(CHEMBL4877672)
Affinity DataIC50:  3.90E+3nM. Assay description: Displacement of Alexa Fluor 647 labelled UNC10245092 peptide from CIB1 (unknown origin) preincubated for 20 mins followed by Alexa-CIB1 phage peptide...
Ligand InfoPC cidPC sid
In DepthDetails ArticlePubMed