BDBM50578120 CHEMBL4858892
SMILES Cc1cc(C)cc(c1)-c1cncc(-c2nc3cc(ccc3[nH]2)C#N)c1N1CCC(N)CC1
InChI Key InChIKey=WPSXCBVWJHNRDN-UHFFFAOYSA-N
Data  1 IC50  1 EC50
  Tab Delimited (TSV)   2D SDfile   Computed 3D by Vconf -m prep SDfile
Find this compound or compounds like it in BindingDB:
Activity Spreadsheet -- Enzyme Inhibition Constant Data from BindingDB
Found 2 hits for monomerid = 50578120
TargetPotassium voltage-gated channel subfamily H member 2(Homo sapiens (Human))
Ono Pharmaceutical
Curated by ChEMBL
LigandPNGBDBM50578120(CHEMBL4858892)
Affinity DataIC50:  2.20E+3nM. Assay description: Inhibition of human ERG expressed in CHO-K1 cells with holding potential -80 mV incubated for 5 mins by patch-clamp assay
Ligand InfoPC cidPC sid
In DepthDetails ArticlePubMed
TargetSomatostatin receptor type 2(Homo sapiens (Human))
Ono Pharmaceutical
Curated by ChEMBL
LigandPNGBDBM50578120(CHEMBL4858892)
Affinity DataEC50:  0.0270nM. Assay description: Agonist activity at human SSTR2 expressed in CHO-K1 cells assessed as inhibition of forskolin-induced cAMP accumulation measured after 30 mins by Glo...
Ligand InfoPC cidPC sid
In DepthDetails ArticlePubMed