BDBM50581210 IPRATROPIUM::Ipratropium::Ipratropium cation::Ipratropium ion
SMILES [H][C@]12CC[C@]([H])(C[C@@H](C1)OC(=O)C(CO)c1ccccc1)[N+]2(C)C(C)C
InChI Key InChIKey=OEXHQOGQTVQTAT-BHIXFJMTSA-N
Data  2 KI
  Tab Delimited (TSV)   2D SDfile   Computed 3D by Vconf -m prep SDfile
Find this compound or compounds like it in BindingDB:
Activity Spreadsheet -- Enzyme Inhibition Constant Data from BindingDB
Found 2 hits for monomerid = 50581210
TargetMuscarinic acetylcholine receptor M3(Homo sapiens (Human))
Chiesi Farmaceutici
Curated by ChEMBL
LigandPNGBDBM50581210(IPRATROPIUM | Ipratropium | Ipratropium cation | I...)
Affinity DataKi:  0.794nM. Assay description: Displacement of [3H]-N-methyl Scopolamine Chloride from human M3 receptor membranes incubated for 2 hrs by scintillation counting analysis
In DepthDetails ArticlePubMed
TargetMuscarinic acetylcholine receptor M2(Homo sapiens (Human))
Chiesi Farmaceutici
Curated by ChEMBL
LigandPNGBDBM50581210(IPRATROPIUM | Ipratropium | Ipratropium cation | I...)
Affinity DataKi:  0.794nM. Assay description: Displacement of [3H]-N-methyl Scopolamine Chloride from human M2 receptor membranes incubated for 2 hrs by scintillation counting analysis
In DepthDetails ArticlePubMed