BDBM508504 5-chloro-2-methoxy-N-[(9aS)-7-oxo-8,9,9a,10-tetrahydro-5H,7H-pyrido[3,2-f]pyrrolo[2,1-c][1,4]oxazepin-3-yl]benzenesulfonamide::US11046710, Example 52
SMILES COc1ccc(Cl)cc1S(=O)(=O)Nc1cnc2OC[C@@H]3CCC(=O)N3Cc2c1
InChI Key InChIKey=FBGOEXRZRGOAMR-AWEZNQCLSA-N
Data  1 IC50
  Tab Delimited (TSV)   2D SDfile   Computed 3D by Vconf -m prep SDfile
Find this compound or compounds like it in BindingDB:
Activity Spreadsheet -- Enzyme Inhibition Constant Data from BindingDB
Found 1 hit for monomerid = 508504
TargetAlkaline phosphatase, tissue-nonspecific isozyme(Homo sapiens (Human))
Daiichi Sankyo
US Patent
LigandPNGBDBM508504(5-chloro-2-methoxy-N-[(9aS)-7-oxo-8,9,9a,10-tetrah...)
Affinity DataIC50:  2.20nM. Assay description: COS1 cells (DS Pharma Biomedical Co., Ltd.) were transfected with human TNAP (OriGene Technologies, Inc.) using Lipofectamine LTX & Plus reagent (Inv...
Ligand InfoPC cidPC sid
In DepthDetails US Patent