BDBM508579 (R)-2-(4-(1-(Benzordiri,31dioxol-5-yl)ethyl)piperazin-1-yl)-N-ethylthiazole-5-carboxamide and (S)-2-(4-(1-(benzordiri,31dioxol-5-yl)ethyl)piperazin-1-yl)-N-ethylthiazole-5-carboxamide::US11046712, No 59::US11046712, No 60
SMILES CCNC(=O)c1cnc(s1)N1CCN(CC1)[C@@H](C)c1ccc2OCOc2c1
InChI Key InChIKey=QFODIYDWZHDUAO-ZDUSSCGKSA-N
Data  2 IC50
  Tab Delimited (TSV)   2D SDfile   Computed 3D by Vconf -m prep SDfile
Find this compound or compounds like it in BindingDB:
Activity Spreadsheet -- Enzyme Inhibition Constant Data from BindingDB
Found 2 hits for monomerid = 508579
TargetProtein O-GlcNAcase(Homo sapiens (Human))
Asceneuron
US Patent
LigandPNGBDBM508579((R)-2-(4-(1-(Benzordiri,31dioxol-5-yl)ethyl)pipera...)
Affinity DataIC50:  125nM. Assay description: 5 μI of the appropriate concentration of a solution of inhibitor in McIlvaine's Buffer (pH 6.5) in 2% DMSO (for a dose response curve calcul...
Ligand InfoPC cidPC sid
In DepthDetails US Patent
TargetProtein O-GlcNAcase(Homo sapiens (Human))
Asceneuron
US Patent
LigandPNGBDBM508579((R)-2-(4-(1-(Benzordiri,31dioxol-5-yl)ethyl)pipera...)
Affinity DataIC50:  5.50E+3nM. Assay description: 5 μI of the appropriate concentration of a solution of inhibitor in McIlvaine's Buffer (pH 6.5) in 2% DMSO (for a dose response curve calcul...
Ligand InfoPC cidPC sid
In DepthDetails US Patent