BDBM51161 2-[(3-methyl-2-pyridyl)carbamoylamino]benzoic acid methyl ester::2-[[[(3-methyl-2-pyridinyl)amino]-oxomethyl]amino]benzoic acid methyl ester::MLS000679472::SMR000297644::cid_6467130::methyl 2-({[(3-methyl-2-pyridinyl)amino]carbonyl}amino)benzoate::methyl 2-[(3-methylpyridin-2-yl)carbamoylamino]benzoate
SMILES COC(=O)c1ccccc1NC(=O)Nc1ncccc1C
InChI Key InChIKey=OSSZXLXXFTUBTA-UHFFFAOYSA-N
Data  1 IC50
  Tab Delimited (TSV)   2D SDfile   Computed 3D by Vconf -m prep SDfile
Find this compound or compounds like it in BindingDB:
Activity Spreadsheet -- Enzyme Inhibition Constant Data from BindingDB
Found 1 hit for monomerid = 51161
TargetGlycoprotein 42(Human herpesvirus 4 type 2)
Emory University
Curated by PubChem BioAssay
LigandPNGBDBM51161(2-[(3-methyl-2-pyridyl)carbamoylamino]benzoic acid...)
Affinity DataIC50:  4.79E+3nM. Assay description: NIH Molecular Libraries Screening Centers Network [MLSCN] Emory Chemical Biology Discovery Center in MLSCN Assay provider: Theodore Jardetzky; Northw...
In DepthDetails PCBioAssay