BDBM51184 2-[6-(4-butoxyphenyl)-3-cyano-4-(trifluoromethyl)pyridin-2-yl]sulfanylacetic acid::2-[6-(4-butoxyphenyl)-3-cyano-4-(trifluoromethyl)pyridin-2-yl]sulfanylethanoic acid::2-[[6-(4-butoxyphenyl)-3-cyano-4-(trifluoromethyl)-2-pyridinyl]thio]acetic acid::2-[[6-(4-butoxyphenyl)-3-cyano-4-(trifluoromethyl)-2-pyridyl]thio]acetic acid::MLS000686386::SMR000313229::cid_2139032::{[6-(4-butoxyphenyl)-3-cyano-4-(trifluoromethyl)pyridin-2-yl]thio}acetic acid
SMILES CCCCOc1ccc(cc1)-c1cc(c(C#N)c(SCC(O)=O)n1)C(F)(F)F
InChI Key InChIKey=WYMPXWBKIMANQJ-UHFFFAOYSA-N
Data  2 IC50
  Tab Delimited (TSV)   2D SDfile   Computed 3D by Vconf -m prep SDfile
Find this compound or compounds like it in BindingDB:
Activity Spreadsheet -- Enzyme Inhibition Constant Data from BindingDB
Found 2 hits for monomerid = 51184
TargetGenome polyprotein(Hepatitis C virus)
The Scripps Research Institute Molecular Screening Center
Curated by PubChem BioAssay
LigandPNGBDBM51184(2-[6-(4-butoxyphenyl)-3-cyano-4-(trifluoromethyl)p...)
Affinity DataIC50:  1.98E+3nM. Assay description: Source (MLPCN Center Name): The Scripps Research Institute Molecular Screening Center (SRIMSC) Center Affiliation: The Scripps Research Institute (TS...
In DepthDetails PCBioAssay
TargetGlycoprotein 42(Human herpesvirus 4 type 2)
Emory University
Curated by PubChem BioAssay
LigandPNGBDBM51184(2-[6-(4-butoxyphenyl)-3-cyano-4-(trifluoromethyl)p...)
Affinity DataIC50:  5.03E+3nM. Assay description: NIH Molecular Libraries Screening Centers Network [MLSCN] Emory Chemical Biology Discovery Center in MLSCN Assay provider: Theodore Jardetzky; Northw...
In DepthDetails PCBioAssay