BDBM512728 WO2021219089, INCoV-600A (3)
SMILES ClCC(=O)N(C(C(=O)NC1CCOCC1)c1cnccn1)c1ccc(cc1)-c1cnco1
InChI Key InChIKey=KZTAQKQYUCQMKS-UHFFFAOYSA-N
Data  1 IC50
  Tab Delimited (TSV)   2D SDfile   Computed 3D by Vconf -m prep SDfile
Find this compound or compounds like it in BindingDB:
Activity Spreadsheet -- Enzyme Inhibition Constant Data from BindingDB
Found 1 hit for monomerid = 512728
TargetReplicase polyprotein 1ab(2019-nCoV)
Insilico Medicine Ip
WIPO
LigandPNGBDBM512728(WO2021219089, INCoV-600A (3))
Affinity DataIC50:  410nM. Assay description: he C-His6-tagged SARS-CoV-2 M PRO (NC_045512) was cloned, expressed in E. coli and purified by WuXi. The substrate of Dabcyl-KTSAVLQ‖SGFRKME- (...
Ligand InfoPC cidPC sid
In DepthDetails PubMed