BDBM512935 Anacardic acid
SMILES OC(=O)c1c(O)cccc1CCCCCCCC=CCC=CCC=C
InChI Key InChIKey=QUVGEKPNSCFQIR-AOSYACOCSA-N
Data  1 IC50
  Tab Delimited (TSV)   2D SDfile   Computed 3D by Vconf -m prep SDfile
Find this compound or compounds like it in BindingDB:
Activity Spreadsheet -- Enzyme Inhibition Constant Data from BindingDB
Found 1 hit for monomerid = 512935
TargetReplicase polyprotein 1ab(2019-nCoV)
Michigan State University
LigandPNGBDBM512935(Anacardic acid)
Affinity DataIC50:  1.10E+4nM. Assay description: This is a review article. Please point to the original journal.
Ligand InfoPC cidPC sid
In DepthDetails ArticlePubMed