BDBM517699 US11123311, Compound 28
SMILES FC(F)(F)Oc1ccc(NC(=O)NC2CCN(CC2)C(=O)C2(CC2)C(F)(F)F)cc1
InChI Key InChIKey=MVSICWOXCOWMCB-UHFFFAOYSA-N
Data  1 KI
  Tab Delimited (TSV)   2D SDfile   Computed 3D by Vconf -m prep SDfile
Find this compound or compounds like it in BindingDB:
Activity Spreadsheet -- Enzyme Inhibition Constant Data from BindingDB
Found 1 hit for monomerid = 517699
TargetBifunctional epoxide hydrolase 2(Homo sapiens (Human))
The Regents of The University of California
US Patent
LigandPNGBDBM517699(US11123311, Compound 28)
Affinity DataKi:  0.0500nM. Assay description: Any of a number of standard assays for determining epoxide hydrolase activity can be used to determine inhibition of sEH. For example, suitable assay...
Ligand InfoPC cidPC sid
In DepthDetails US Patent