BDBM518987 US11141403, Example 36::methyl 4-(1-{3- [cyclohexyl(ethyl) amino]-3-oxopropyl}- 1H-benzimidazol-2- yl)benzoate
SMILES CCN(C1CCCCC1)C(=O)CCn1c(nc2ccccc12)-c1ccc(cc1)C(=O)OC
InChI Key InChIKey=GWOODUXWJSUOPV-UHFFFAOYSA-N
Data  1 IC50
  Tab Delimited (TSV)   2D SDfile   Computed 3D by Vconf -m prep SDfile
Find this compound or compounds like it in BindingDB:
Activity Spreadsheet -- Enzyme Inhibition Constant Data from BindingDB
Found 1 hit for monomerid = 518987
TargetN-acetylglucosamine-1-phosphotransferase subunits alpha/beta(Human)
Merck Sharp & Dohme
US Patent
LigandPNGBDBM518987(US11141403, Example 36 | methyl 4-(1-{3- [cyclohex...)
Affinity DataIC50:  130nM. Assay description: The TarO biochemical enzymatic assay is a liquid chromatography-mass spectroscopy (LC-MS) based end point assay that measures C55-P-P-GlcNAc (LIPID I...
Ligand InfoPC cidPC sid
In DepthDetails US Patent