BDBM524249 Preparation of Ethyl (3-methylpiperidine-1-carbonothioyl)carbamate::US11168080, Compound A-19
SMILES CC1CCCN(C1)c1nc(Cn2cc(C)cc2C(=O)Nc2ccc(cc2)C(O)=O)cs1
InChI Key InChIKey=OUZUTBZNSQTLSI-UHFFFAOYSA-N
Data  1 IC50
  Tab Delimited (TSV)   2D SDfile   Computed 3D by Vconf -m prep SDfile
Find this compound or compounds like it in BindingDB:
Activity Spreadsheet -- Enzyme Inhibition Constant Data from BindingDB
Found 1 hit for monomerid = 524249
TargetDynamin-1-like protein(Human)
Mitobridge
US Patent
LigandPNGBDBM524249(Preparation of Ethyl (3-methylpiperidine-1-carbono...)
Affinity DataIC50:  2.70E+3nM. Assay description: The GTPase activity of Drp1 was assayed using a colorimetric assay similar to as described previously by Leonard M. et al. “Robust colorimetric assay...
Ligand InfoPC cidPC sid
In DepthDetails US Patent