BDBM525173 Benzyl N-[(1S)-1-[[(2-chloroacetyl)-(1H-imidazol-4-ylmethyl)amino]carbamoyl]-3-methyl-butyl]carbamate::WO2022043374, Example 24
SMILES CC(C)C[C@H](NC(=O)OCc1ccccc1)C(=O)NN(Cc1c[nH]cn1)C(=O)CCl
InChI Key InChIKey=PFDKLEKNOWSPFG-KRWDZBQOSA-N
Data  2 IC50
  Tab Delimited (TSV)   2D SDfile   Computed 3D by Vconf -m prep SDfile
Find this compound or compounds like it in BindingDB:
Activity Spreadsheet -- Enzyme Inhibition Constant Data from BindingDB
Found 2 hits for monomerid = 525173
TargetReplicase polyprotein 1ab(2019-nCoV)
A*Star
Curated by ChEMBL
LigandPNGBDBM525173(Benzyl N-[(1S)-1-[[(2-chloroacetyl)-(1H-imidazol-4...)
Affinity DataIC50:  87nM. Assay description: Inhibition of recombinant SARS-CoV-2 3CLpro expressed in Escherichia coli BL21 DE3 using FAM-KTSAVLQSGFRKMEK-TAMRA fluorogenic peptide as substrate p...
Ligand InfoPC cidPC sid
In DepthDetails PubMed
TargetReplicase polyprotein 1ab(2019-nCoV)
A*Star
Curated by ChEMBL
LigandPNGBDBM525173(Benzyl N-[(1S)-1-[[(2-chloroacetyl)-(1H-imidazol-4...)
Affinity DataIC50:  87nM. Assay description: For the SARS-CoV-2 3CLpro assay, 2 μL of 0.02 μM recombinant SARS-CoV-2 3CL protease were mixed with serial dilutions of each c...
Ligand InfoPC cidPC sid
In DepthDetails PubMed