BDBM525252 N-[(1S)-1-[[[(2R)-2-chloro-2-fluoro-acetyl]-[[(3S)-2-oxopyrrolidin-3-yl]methyl]amino]carbamoyl]-4-methyl-pentyl]-5-methyl-isoxazole-3-carboxamide::WO2022043374, Example 101
SMILES CC(C)CC[C@H](NC(=O)c1cc(C)on1)C(=O)NN(C[C@@H]1CCNC1=O)C(=O)[C@H](F)Cl
InChI Key InChIKey=HWUIYNOFYVRYOP-YDHLFZDLSA-N
Data  5 IC50
  Tab Delimited (TSV)   2D SDfile   Computed 3D by Vconf -m prep SDfile
Find this compound or compounds like it in BindingDB:
Activity Spreadsheet -- Enzyme Inhibition Constant Data from BindingDB
Found 5 hits for monomerid = 525252
TargetReplicase polyprotein 1ab(2019-nCoV)
F. Hoffmann-La Roche
WIPO
LigandPNGBDBM525252(N-[(1S)-1-[[[(2R)-2-chloro-2-fluoro-acetyl]-[[(3S)...)
Affinity DataIC50:  90nM. Assay description: For the SARS-CoV-2 3CLpro assay, 2 μL of 0.02 μM recombinant SARS-CoV-2 3CL protease were mixed with serial dilutions of each c...
Ligand InfoPC cidPC sid
In DepthDetails PubMed
TargetReplicase polyprotein 1ab(HCoV-229E)
F. Hoffmann-La Roche
WIPO
LigandPNGBDBM525252(N-[(1S)-1-[[[(2R)-2-chloro-2-fluoro-acetyl]-[[(3S)...)
Affinity DataIC50:  74nM. Assay description: For the HCoV-229E 3CLpro assay, 2 μL of 0.02 μM recombinant HCoV-229E 3CL protease were mixed with serial dilutions of each com...
Ligand InfoPC cidPC sid
In DepthDetails PubMed
TargetReplicase polyprotein 1ab(Human SARS coronavirus (SARS-CoV) (Severe acute re...)
F. Hoffmann-La Roche
WIPO
LigandPNGBDBM525252(N-[(1S)-1-[[[(2R)-2-chloro-2-fluoro-acetyl]-[[(3S)...)
Affinity DataIC50:  160nM. Assay description: For the SARS-CoV 3CLpro assay, 2 μL of 0.02 μM recombinant SARS-CoV 3CL protease were mixed with serial dilutions of each compo...
Ligand InfoPC cidPC sid
In DepthDetails PubMed
TargetReplicase polyprotein 1ab(HCoV-OC43)
F. Hoffmann-La Roche
WIPO
LigandPNGBDBM525252(N-[(1S)-1-[[[(2R)-2-chloro-2-fluoro-acetyl]-[[(3S)...)
Affinity DataIC50:  23nM. Assay description:  For the HCoV-OC433CLpro assay, 2 μL of 0.02 μM recombinant HCoV-OC433CL protease were mixed with serial dilutions of each comp...
Ligand InfoPC cidPC sid
In DepthDetails PubMed
TargetOrf1a protein(MERS-CoV)
F. Hoffmann-La Roche
WIPO
LigandPNGBDBM525252(N-[(1S)-1-[[[(2R)-2-chloro-2-fluoro-acetyl]-[[(3S)...)
Affinity DataIC50:  320nM. Assay description: For the MERS-CoV 3CLpro assay, 2 μL of 0.02 μM recombinant MERS-CoV 3CL protease were mixed with serial dilutions of each compo...
Ligand InfoPC cidPC sid
In DepthDetails PubMed