BDBM526341 US11186554, Compound 90::ethyl 2-(5-methyl-4-(2-((3- (trifluoromethyl)phenyl)amino)phenyl)-1H- pyrazol-1-yl)acetate
SMILES CCOC(=O)Cn1ncc(c1C)-c1ccccc1Nc1cccc(c1)C(F)(F)F
InChI Key InChIKey=NVYPFVBKKZTIJZ-UHFFFAOYSA-N
Data  1 IC50
  Tab Delimited (TSV)   2D SDfile   Computed 3D by Vconf -m prep SDfile
Find this compound or compounds like it in BindingDB:
Activity Spreadsheet -- Enzyme Inhibition Constant Data from BindingDB
Found 1 hit for monomerid = 526341
TargetLuciferin 4-monooxygenase(Southern Russian firefly)
Vivace Therapeutics
US Patent
LigandPNGBDBM526341(US11186554, Compound 90 | ethyl 2-(5-methyl-4-(2-(...)
Affinity DataIC50:  3.00E+3nM. Assay description: HEK293T cells stably transfected with 8XTBD luciferase reporter and pRLTK in 384-well plates were treated with the test compounds, starting from 3 &#...
Ligand InfoPC cidPC sid
In DepthDetails US Patent