BDBM526390 US11186554, Compound 162::[1-acetyl-3-[[5-[2-[4- (trifluoromethyl)anilino]phenyl]tetrazol-2- yl]methyl]azetidin-3-yl]acetate
SMILES CC(=O)OC1(CN2NNC(=N2)c2ccccc2Nc2ccc(cc2)C(F)(F)F)CN(C1)C(C)=O
InChI Key InChIKey=PDHGWCIQGPFCME-UHFFFAOYSA-N
Data  1 IC50
  Tab Delimited (TSV)   2D SDfile   Computed 3D by Vconf -m prep SDfile
Find this compound or compounds like it in BindingDB:
Activity Spreadsheet -- Enzyme Inhibition Constant Data from BindingDB
Found 1 hit for monomerid = 526390
TargetLuciferin 4-monooxygenase(Southern Russian firefly)
Vivace Therapeutics
US Patent
LigandPNGBDBM526390(US11186554, Compound 162 | [1-acetyl-3-[[5-[2-[4- ...)
Affinity DataIC50:  3.00E+3nM. Assay description: HEK293T cells stably transfected with 8XTBD luciferase reporter and pRLTK in 384-well plates were treated with the test compounds, starting from 3 &#...
Ligand InfoPC cidPC sid
In DepthDetails US Patent