BDBM530500 WO2022076764, Example 29
SMILES CCOC(=O)c1cc(on1)-c1cn(c(NC(=O)c2ccc(OC(F)F)cc2)n1)-c1ccc(OC)cc1
InChI Key InChIKey=UUCBZTYHXDHOAX-UHFFFAOYSA-N
Data  2 EC50
  Tab Delimited (TSV)   2D SDfile   Computed 3D by Vconf -m prep SDfile
Find this compound or compounds like it in BindingDB:
Activity Spreadsheet -- Enzyme Inhibition Constant Data from BindingDB
Found 2 hits for monomerid = 530500
TargetN-formyl peptide receptor 2(Homo sapiens (Human))
Bristol-Myers Squibb
WIPO
LigandPNGBDBM530500(WO2022076764, Example 29)
Affinity DataEC50:  32nM
Ligand InfoPC cidPC sid
In DepthDetails PubMed
TargetfMet-Leu-Phe receptor(Homo sapiens (Human))
Bristol-Myers Squibb
WIPO
LigandPNGBDBM530500(WO2022076764, Example 29)
Affinity DataEC50:  15nM
Ligand InfoPC cidPC sid
In DepthDetails PubMed