BDBM530828 WO2022076496, Example 125
SMILES CC1(CS(=O)(=O)C1)NC(=O)c1cc2c(N(C(=O)C22CCCC2)c2cccc(OC(F)F)c2)c(F)c1
InChI Key InChIKey=MCLNHJHWJBVNFM-UHFFFAOYSA-N
Data  1 IC50
  Tab Delimited (TSV)   2D SDfile   Computed 3D by Vconf -m prep SDfile
Find this compound or compounds like it in BindingDB:
Activity Spreadsheet -- Enzyme Inhibition Constant Data from BindingDB
Found 1 hit for monomerid = 530828
TargetDiacylglycerol O-acyltransferase 2(Homo sapiens (Human))
Merck Sharp &Amp
WIPO
LigandPNGBDBM530828(WO2022076496, Example 125)
Affinity DataIC50:  68nM
Ligand InfoPC cidPC sid
In DepthDetails PubMed