BDBM533955 2-{[6-(Azetidin-1-yl)-4-fluoro-1-benzofuran-2-carbonyl]sulfamoyl}phenyl methyl(phenyl)carbamate::WO2022081807, Example 62
SMILES CN(C(=O)Oc1ccccc1S(=O)(=O)NC(=O)c1cc2c(F)cc(cc2o1)N1CCC1)c1ccccc1
InChI Key InChIKey=KVIFCYFUNVXDRF-UHFFFAOYSA-N
Data  1 IC50
  Tab Delimited (TSV)   2D SDfile   Computed 3D by Vconf -m prep SDfile
Find this compound or compounds like it in BindingDB:
Activity Spreadsheet -- Enzyme Inhibition Constant Data from BindingDB
Found 1 hit for monomerid = 533955
TargetHistone acetyltransferase KAT6A [507-778](Homo sapiens)
The Broad Institute
WIPO
LigandPNGBDBM533955(2-{[6-(Azetidin-1-yl)-4-fluoro-1-benzofuran-2-carb...)
Affinity DataIC50:  196nM. Assay description: Kat6a inhibitory activities of the compounds described in the present invention were quantified using a Fluorescence Resonance Energy Transfer (TR-FR...
Ligand InfoPC cidPC sid
In DepthDetails PubMed