BDBM534254 ((2R,3S,4R,5R)-5-(4-aminopyrrolo[2,1-f][1,2,4]triazin-7-yl)-5-cyano-3,4-dihydroxytetrahydrofuran-2-yl)methyl ((R)-2-(2-cyanobenzamido)-3-(octadecyloxy)propyl) hydrogen phosphate (58)::WO2022081973, Example 58
SMILES CCCCCCCCCCCCCCCCCCOC[C@H](COP(O)(=O)OC[C@H]1O[C@](C#N)([C@H](O)[C@@H]1O)c1ccc2c(N)ncnn12)NC(=O)c1ccccc1C#N
InChI Key InChIKey=DZWSETRHYUFKMH-ULIKONMOSA-N
Data  2 EC50
  Tab Delimited (TSV)   2D SDfile   Computed 3D by Vconf -m prep SDfile
Find this compound or compounds like it in BindingDB:
Activity Spreadsheet -- Enzyme Inhibition Constant Data from BindingDB
Found 2 hits for monomerid = 534254
TargetFusion glycoprotein F0(Human respiratory syncytial virus A (strain A2))
Gilead Sciences
WIPO
LigandPNGBDBM534254(((2R,3S,4R,5R)-5-(4-aminopyrrolo[2,1-f][1,2,4]tria...)
Affinity DataEC50:  300nM. Assay description: Antiviral activity of compounds against SARS-CoV-2 is evaluated as described in Xue, Xi et al.2020. Briefly, the human alveolar epithelial cell line ...
Ligand InfoPC cidPC sid
In DepthDetails PubMed
TargetReplicase polyprotein 1ab(2019-nCoV)
Gilead Sciences
WIPO
LigandPNGBDBM534254(((2R,3S,4R,5R)-5-(4-aminopyrrolo[2,1-f][1,2,4]tria...)
Affinity DataEC50:  5.10E+3nM. Assay description: Antiviral activity of compounds against SARS-CoV-2 is evaluated as described in Xue, Xi et al.2020. Briefly, the human alveolar epithelial cell line ...
Ligand InfoPC cidPC sid
In DepthDetails PubMed