BDBM53609 MLS000723011::N-[2-(3-chloroanilino)-1,3-benzodioxol-2-yl]carbamic acid ethyl ester::SMR000236329::cid_764746::ethyl N-[2-(3-chloroanilino)-1,3-benzodioxol-2-yl]carbamate::ethyl N-[2-[(3-chlorophenyl)amino]-1,3-benzodioxol-2-yl]carbamate
SMILES CCOC(=O)NC1(Nc2cccc(Cl)c2)Oc2ccccc2O1
InChI Key InChIKey=QREAJHCTKAQKPY-UHFFFAOYSA-N
Data  1 IC50
  Tab Delimited (TSV)   2D SDfile   Computed 3D by Vconf -m prep SDfile
Find this compound or compounds like it in BindingDB:
Activity Spreadsheet -- Enzyme Inhibition Constant Data from BindingDB
Found 1 hit for monomerid = 53609
TargetMannose-6-phosphate isomerase(Homo sapiens (Human))
Sanford-Burnham Center For Chemical Genomics
Curated by PubChem BioAssay
LigandPNGBDBM53609(MLS000723011 | N-[2-(3-chloroanilino)-1,3-benzodio...)
Affinity DataIC50:  5.00E+4nM. Assay description: Data Source: Sanford-Burnham Center for Chemical Genomics (SBCCG) Source Affiliation: Sanford-Burnham Medical Research Institute (SBMRI, San Diego, C...
In DepthDetails PCBioAssay