BDBM53672 MLS000077810::N-[5-(4-keto-3-methyl-phthalazin-1-yl)-2-methyl-benzyl]-2-furamide::N-[[2-methyl-5-(3-methyl-4-oxidanylidene-phthalazin-1-yl)phenyl]methyl]furan-2-carboxamide::N-[[2-methyl-5-(3-methyl-4-oxo-1-phthalazinyl)phenyl]methyl]-2-furancarboxamide::N-[[2-methyl-5-(3-methyl-4-oxophthalazin-1-yl)phenyl]methyl]furan-2-carboxamide::SMR000037025::cid_661961
SMILES Cc1ccc(cc1CNC(=O)c1ccco1)-c1nn(C)c(=O)c2ccccc12
InChI Key InChIKey=FDJSYFKNKYRDSI-UHFFFAOYSA-N
Data  1 IC50
  Tab Delimited (TSV)   2D SDfile   Computed 3D by Vconf -m prep SDfile
Find this compound or compounds like it in BindingDB:
Activity Spreadsheet -- Enzyme Inhibition Constant Data from BindingDB
Found 1 hit for monomerid = 53672
TargetM1 family aminopeptidase(Plasmodium falciparum (isolate FcB1 / Columbia))
Srmlsc
Curated by PubChem BioAssay
LigandPNGBDBM53672(MLS000077810 | N-[5-(4-keto-3-methyl-phthalazin-1-...)
Affinity DataIC50:  2.11E+4nM. Assay description: Southern Research Molecular Libraries Screening Center (SRMLSC) Southern Research Institute (Birmingham, Alabama) NIH Molecular Libraries Screening...
In DepthDetails PCBioAssay