BDBM543836 2-hydroxyethyl 2-{4-[(1S)-1-[(4-chloro-1,6-dimethyl-1H-indol-2-yl)formamido]-2- hydroxyethyl]benzenesulfonyl}acetate::US11304929, Example 09-034
SMILES Cc1cc(Cl)c2cc(C(=O)N[C@H](CO)c3ccc(cc3)S(=O)(=O)CC(=O)OCCO)n(C)c2c1
InChI Key InChIKey=MFDBLMCSVAPYHO-LJQANCHMSA-N
Data  1 IC50
  Tab Delimited (TSV)   2D SDfile   Computed 3D by Vconf -m prep SDfile
Find this compound or compounds like it in BindingDB:
Activity Spreadsheet -- Enzyme Inhibition Constant Data from BindingDB
Found 1 hit for monomerid = 543836
TargetD-3-phosphoglycerate dehydrogenase(Homo sapiens (Human))
Boehringer Ingelheim International
US Patent
LigandPNGBDBM543836(2-hydroxyethyl 2-{4-[(1S)-1-[(4-chloro-1,6-dimethy...)
Affinity DataIC50:  52nM. Assay description: Compounds are dispensed onto assay plates (black, low volume, flat bottom 384 well, Corning) using an Access Labcyte Workstation with the Labcyte Ech...
Ligand InfoPC cidPC sid
In DepthDetails US Patent