BDBM549356 US11304929, Example 11-001::methyl 2-{4-[(1R)-1-[(4,5-dichloro-1,6-dimethyl-1H-indol-2- yl)formamido]ethyl]benzenesulfinyl}acetate
SMILES COC(=O)CS(=O)c1ccc(cc1)[C@@H](C)NC(=O)c1cc2c(Cl)c(Cl)c(C)cc2n1C
InChI Key InChIKey=MCFIXNPZYPSTED-BWFPZVSSSA-N
Data  2 IC50
  Tab Delimited (TSV)   2D SDfile   Computed 3D by Vconf -m prep SDfile
Find this compound or compounds like it in BindingDB:
Activity Spreadsheet -- Enzyme Inhibition Constant Data from BindingDB
Found 2 hits for monomerid = 549356
TargetD-3-phosphoglycerate dehydrogenase(Homo sapiens (Human))
Boehringer Ingelheim International
US Patent
LigandPNGBDBM549356(US11304929, Example 11-001 | methyl 2-{4-[(1R)-1-[...)
Affinity DataIC50:  436nM. Assay description: Compounds are dispensed onto assay plates (black, low volume, flat bottom 384 well, Corning) using an Access Labcyte Workstation with the Labcyte Ech...
Ligand InfoPC cidPC sid
In DepthDetails US Patent
TargetD-3-phosphoglycerate dehydrogenase(Homo sapiens (Human))
Boehringer Ingelheim International
US Patent
LigandPNGBDBM549356(US11304929, Example 11-001 | methyl 2-{4-[(1R)-1-[...)
Affinity DataIC50:  296nM. Assay description: Compounds are dispensed onto assay plates (black, low volume, flat bottom 384 well, Corning) using an Access Labcyte Workstation with the Labcyte Ech...
Ligand InfoPC cidPC sid
In DepthDetails US Patent