BDBM549411 2-methoxyethyl 2-{4-[(1R)-1-[(1-methyl-3-phenyl-1H-pyrazol-5- yl)formamido]ethyl]benzenesulfonyl}acetate::US11304929, Example 10-001
SMILES COCCOC(=O)CS(=O)(=O)c1ccc(cc1)[C@@H](C)NC(=O)c1cc(nn1C)-c1ccccc1
InChI Key InChIKey=BFGHKEDRUIISSM-QGZVFWFLSA-N
Data  1 IC50
  Tab Delimited (TSV)   2D SDfile   Computed 3D by Vconf -m prep SDfile
Find this compound or compounds like it in BindingDB:
Activity Spreadsheet -- Enzyme Inhibition Constant Data from BindingDB
Found 1 hit for monomerid = 549411
TargetD-3-phosphoglycerate dehydrogenase(Homo sapiens (Human))
Boehringer Ingelheim International
US Patent
LigandPNGBDBM549411(2-methoxyethyl 2-{4-[(1R)-1-[(1-methyl-3-phenyl-1H...)
Affinity DataIC50:  1.45E+3nM. Assay description: Compounds are dispensed onto assay plates (black, low volume, flat bottom 384 well, Corning) using an Access Labcyte Workstation with the Labcyte Ech...
Ligand InfoPC cidPC sid
In DepthDetails US Patent