BDBM549429 2-hydroxyethyl 2-{4-[(1R)-1-[(4-chloro-1,6-dimethyl-1H-indol-2- yl)formamido]ethyl]benzenesulfonyl}acetate::US11304929, Example 09-007
SMILES C[C@@H](NC(=O)c1cc2c(Cl)cc(C)cc2n1C)c1ccc(cc1)S(=O)(=O)CC(=O)OCCO
InChI Key InChIKey=RBGBTPFQYGLCGP-OAHLLOKOSA-N
Data  1 IC50
  Tab Delimited (TSV)   2D SDfile   Computed 3D by Vconf -m prep SDfile
Find this compound or compounds like it in BindingDB:
Activity Spreadsheet -- Enzyme Inhibition Constant Data from BindingDB
Found 1 hit for monomerid = 549429
TargetD-3-phosphoglycerate dehydrogenase(Homo sapiens (Human))
Boehringer Ingelheim International
US Patent
LigandPNGBDBM549429(2-hydroxyethyl 2-{4-[(1R)-1-[(4-chloro-1,6-dimethy...)
Affinity DataIC50:  166nM. Assay description: Compounds are dispensed onto assay plates (black, low volume, flat bottom 384 well, Corning) using an Access Labcyte Workstation with the Labcyte Ech...
Ligand InfoPC cidPC sid
In DepthDetails US Patent