BDBM549432 US11304929, Example 01-005::ethyl 2-{4-[(1S)-1-[(4-chloro-1,6-dimethyl-1H-indol-2-yl)formamido]-2- hydroxyethyl]benzenesulfonyl}acetate
SMILES CCOC(=O)CS(=O)(=O)c1ccc(cc1)[C@@H](CO)NC(=O)c1cc2c(Cl)cc(C)cc2n1C
InChI Key InChIKey=UAVDVKYUELREOJ-LJQANCHMSA-N
Data  1 IC50
  Tab Delimited (TSV)   2D SDfile   Computed 3D by Vconf -m prep SDfile
Find this compound or compounds like it in BindingDB:
Activity Spreadsheet -- Enzyme Inhibition Constant Data from BindingDB
Found 1 hit for monomerid = 549432
TargetD-3-phosphoglycerate dehydrogenase(Homo sapiens (Human))
Boehringer Ingelheim International
US Patent
LigandPNGBDBM549432(US11304929, Example 01-005 | ethyl 2-{4-[(1S)-1-[(...)
Affinity DataIC50:  223nM. Assay description: Compounds are dispensed onto assay plates (black, low volume, flat bottom 384 well, Corning) using an Access Labcyte Workstation with the Labcyte Ech...
Ligand InfoPC cidPC sid
In DepthDetails US Patent