BDBM549435 2-methoxyethyl 2-{4-[(1R)-1-{[1-methyl-5-(trifluoromethyl)-1H-indol-2- yl]formamido}ethyl]benzenesulfonyl}acetate::US11304929, Example 09-008
SMILES COCCOC(=O)CS(=O)(=O)c1ccc(cc1)[C@@H](C)NC(=O)c1cc2cc(ccc2n1C)C(F)(F)F
InChI Key InChIKey=TVTWMHUKFNYTIJ-OAHLLOKOSA-N
Data  1 IC50
  Tab Delimited (TSV)   2D SDfile   Computed 3D by Vconf -m prep SDfile
Find this compound or compounds like it in BindingDB:
Activity Spreadsheet -- Enzyme Inhibition Constant Data from BindingDB
Found 1 hit for monomerid = 549435
TargetD-3-phosphoglycerate dehydrogenase(Homo sapiens (Human))
Boehringer Ingelheim International
US Patent
LigandPNGBDBM549435(2-methoxyethyl 2-{4-[(1R)-1-{[1-methyl-5-(trifluor...)
Affinity DataIC50:  3.46E+3nM. Assay description: Compounds are dispensed onto assay plates (black, low volume, flat bottom 384 well, Corning) using an Access Labcyte Workstation with the Labcyte Ech...
Ligand InfoPC cidPC sid
In DepthDetails US Patent