BDBM55106 1-[5-chloranyl-2-(trifluoromethyl)-1,3-benzodioxol-2-yl]-3-(5-methyl-1,2-oxazol-3-yl)urea::1-[5-chloro-2-(trifluoromethyl)-1,3-benzodioxol-2-yl]-3-(5-methyl-1,2-oxazol-3-yl)urea::1-[5-chloro-2-(trifluoromethyl)-1,3-benzodioxol-2-yl]-3-(5-methyl-3-isoxazolyl)urea::1-[5-chloro-2-(trifluoromethyl)-1,3-benzodioxol-2-yl]-3-(5-methylisoxazol-3-yl)urea::MLS000044271::SMR000015932::cid_3244573
SMILES Cc1cc(NC(=O)NC2(Oc3ccc(Cl)cc3O2)C(F)(F)F)no1
InChI Key InChIKey=ABCRYGIZLVABPS-UHFFFAOYSA-N
Data  6 IC50
  Tab Delimited (TSV)   2D SDfile   Computed 3D by Vconf -m prep SDfile
Find this compound or compounds like it in BindingDB:
Activity Spreadsheet -- Enzyme Inhibition Constant Data from BindingDB
Found 6 hits for monomerid = 55106
TargetM18 aspartyl aminopeptidase(Plasmodium falciparum 3D7)
The Scripps Research Institute Molecular Screening Center
Curated by PubChem BioAssay
LigandPNGBDBM55106(1-[5-chloranyl-2-(trifluoromethyl)-1,3-benzodioxol...)
Affinity DataIC50:  1.69E+3nM. Assay description: Source (MLPCN Center Name): The Scripps Research Institute Molecular Screening Center Affiliation: The Scripps Research Institute, TSRI Assay Provide...
In DepthDetails PCBioAssay
TargetProcathepsin L(Homo sapiens (Human))
The Scripps Research Institute Molecular Screening Center
Curated by PubChem BioAssay
LigandPNGBDBM55106(1-[5-chloranyl-2-(trifluoromethyl)-1,3-benzodioxol...)
Affinity DataIC50: >5.96E+4nM. Assay description: Source (MLPCN Center Name): The Scripps Research Institute Molecular Screening Center Affiliation: The Scripps Research Institute, TSRI Assay Provide...
In DepthDetails PCBioAssay
TargetDNA damage-inducible transcript 3 protein(Mus musculus)
Emory University
Curated by PubChem BioAssay
LigandPNGBDBM55106(1-[5-chloranyl-2-(trifluoromethyl)-1,3-benzodioxol...)
Affinity DataIC50:  2.16E+3nM. Assay description: NIH Molecular Libraries Screening Centers Network [MLSCN] Emory Chemical Biology Discovery Center in MLSCN Assay provider: Dr. Randal Kaufman, Univer...
In DepthDetails PCBioAssay
TargetDNA damage-inducible transcript 3 protein(Mus musculus)
Emory University
Curated by PubChem BioAssay
LigandPNGBDBM55106(1-[5-chloranyl-2-(trifluoromethyl)-1,3-benzodioxol...)
Affinity DataIC50:  2.16E+3nM. Assay description: NIH Molecular Libraries Screening Centers Network [MLSCN] Emory Chemical Biology Discovery Center in MLSCN Assay provider: Dr. Randal Kaufman, Univer...
In DepthDetails PCBioAssay
TargetX-box-binding protein 1(Homo sapiens (Human))
Emory University
Curated by PubChem BioAssay
LigandPNGBDBM55106(1-[5-chloranyl-2-(trifluoromethyl)-1,3-benzodioxol...)
Affinity DataIC50:  160nM. Assay description: NIH Molecular Libraries Screening Centers Network [MLSCN] Emory Chemical Biology Discovery Center in MLSCN Assay provider: Dr. Randal Kaufman, Univer...
In DepthDetails PCBioAssay
TargetE3 ubiquitin-protein ligase XIAP(Homo sapiens (Human))
Sanford-Burnham Center For Chemical Genomics
Curated by PubChem BioAssay
LigandPNGBDBM55106(1-[5-chloranyl-2-(trifluoromethyl)-1,3-benzodioxol...)
Affinity DataIC50:  1.00E+5nM. Assay description: Data Source: Sanford-Burnham Center for Chemical Genomics (SBCCG) Source Affiliation: Sanford-Burnham Medical Research Institute (SBMRI, San Diego, C...
In DepthDetails PCBioAssay