BDBM551738 US11312722, Compound 28
SMILES COc1ccc(Cn2nc(C)cc2Nc2cc(O)cc(O)c2C(=O)N2Cc3ccc(F)cc3C2)cc1
InChI Key InChIKey=BAIQXAWXWJWKIP-UHFFFAOYSA-N
Data  2 EC50
  Tab Delimited (TSV)   2D SDfile   Computed 3D by Vconf -m prep SDfile
Find this compound or compounds like it in BindingDB:
Activity Spreadsheet -- Enzyme Inhibition Constant Data from BindingDB
Found 2 hits for monomerid = 551738
TargetHeat shock protein 90 homolog(Yeast)
Trustees of Boston University
US Patent
LigandPNGBDBM551738(US11312722, Compound 28)
Affinity DataEC50:  54nM. Assay description: EC50 values were determined by FP-based equilibrium competition assay performed in 384-well format using whole cell lysates prepared from C. neoforma...
Ligand InfoPC cidPC sid
In DepthDetails US Patent
TargetHsp90 chaperone protein kinase-targeting subunit(Filobasidiella neoformans)
Trustees of Boston University
US Patent
LigandPNGBDBM551738(US11312722, Compound 28)
Affinity DataEC50:  592nM. Assay description: EC50 values were determined by FP-based equilibrium competition assay performed in 384-well format using whole cell lysates prepared from C. neoforma...
Ligand InfoPC cidPC sid
In DepthDetails US Patent