BDBM553935 US11325905, Compound A44B4C66
SMILES OC(C1C=CC2[C@H](N1Nc1ccc(cc1)N(=O)=O)C(=O)N(C2=O)c1ccc(cc1)N1CCOCC1)c1ccc(Br)cc1
InChI Key InChIKey=PSIHTBAVIBYCPX-MGDPKONKSA-N
Data  1 IC50  1 Kd
  Tab Delimited (TSV)   2D SDfile   Computed 3D by Vconf -m prep SDfile
Find this compound or compounds like it in BindingDB:
Activity Spreadsheet -- Enzyme Inhibition Constant Data from BindingDB
Found 2 hits for monomerid = 553935
TargetBifunctional polynucleotide phosphatase/kinase(Human)
The Governors of The University of Alberta
US Patent
LigandPNGBDBM553935(US11325905, Compound A44B4C66)
Affinity DataIC50:  1.70E+4nM. Assay description: Kd values were measured by steady-state fluorescence spectroscopy, by following protein tryptophan fluorescence quenching as a function of ligand con...
Ligand InfoPC cidPC sid
In DepthDetails US Patent
TargetBifunctional polynucleotide phosphatase/kinase(Human)
The Governors of The University of Alberta
US Patent
LigandPNGBDBM553935(US11325905, Compound A44B4C66)
Affinity DataKd:  120nM. Assay description: Kd values were measured by steady-state fluorescence spectroscopy, by following protein tryptophan fluorescence quenching as a function of ligand con...
Ligand InfoPC cidPC sid
In DepthDetails US Patent