BDBM5587 5-benzoyl-6-(cyclohexylmethoxy)pyrimidine-2,4-diamine::pyrimidine deriv. 15
SMILES Nc1nc(N)c(C(=O)c2ccccc2)c(OCC2CCCCC2)n1
InChI Key InChIKey=BSZYWCVHKOGYIH-UHFFFAOYSA-N
  Tab Delimited (TSV)   2D SDfile   Computed 3D by Vconf -m prep SDfile
Find this compound or compounds like it in BindingDB:
Activity Spreadsheet -- Enzyme Inhibition Constant Data from BindingDB
Found 2 hits for monomerid = 5587
TargetCyclin-A2 [171-432]/Cyclin-dependent kinase 2(Homo sapiens (Human))
University Of Newcastle
LigandPNGBDBM5587(5-benzoyl-6-(cyclohexylmethoxy)pyrimidine-2,4-diam...)
Affinity Data. Assay description: The enzyme was assayed with substrate histone H1 in the presence of 12.5 uM ATP/[gamma-32P] ATP. IC50 is the inhibitor concentration, which inhibits ...
In DepthDetails ArticlePubMed
TargetCyclin-dependent kinase 1/G2/mitotic-specific cyclin-B(Marthasterias glacialis (starfish))
University Of Newcastle
LigandPNGBDBM5587(5-benzoyl-6-(cyclohexylmethoxy)pyrimidine-2,4-diam...)
Affinity Data. Assay description: The enzyme was assayed with substrate histone H1 in the presence of 12.5 uM ATP/[gamma-32P] ATP. IC50 is the inhibitor concentration, which inhibits ...
In DepthDetails ArticlePubMed